{"text_format":"1","workbook":"xlsx","n_sheets":6,"sheets":["DEMANDE","ANALYSE","COMITÉ DE RECOMMANDATIONS","BILAN","LISTES","INFOS"],"not_rendered":{"charts":0,"images":0,"macros":1,"external_links":0,"defined_names":3,"comments":2,"pivot_tables":0},"unopened":[],"bounds":{"document_bytes":16777216,"sheet_cells":100000,"rows_first":2000,"rows_last":500,"rows_between":2000,"halvings":0,"cell_chars":16384,"cell_head_chars":4096},"cells_cut":0,"cells_raw":0,"read":"whole","date_system":"1900"}

{"sheet":"DEMANDE","index":0,"n_rows":169,"n_cols":14,"rows_kept":169,"cut":false,"hidden":false,"merged":[[6,0,6,5],[6,6,6,7],[58,0,58,1],[59,0,59,1],[60,0,60,1],[55,7,57,7],[58,7,62,7],[58,2,58,3],[56,2,56,3],[57,2,57,3],[16,5,16,7],[34,1,34,6],[53,0,53,7],[143,0,143,7],[38,1,38,3],[37,0,37,7],[44,1,44,3],[45,1,45,3],[46,1,46,3],[47,1,47,3],[48,1,48,3],[55,0,55,1],[56,0,56,1],[57,0,57,1],[63,0,63,4],[61,0,61,1],[62,0,62,1],[127,9,127,12],[129,9,129,12],[84,0,84,7],[85,0,94,7],[14,5,14,7],[28,1,28,2],[65,0,65,7],[73,0,73,7],[74,0,81,7],[71,1,71,7],[119,6,119,7],[69,1,69,7],[97,0,97,7],[49,1,49,3],[62,2,62,3],[50,1,50,3],[168,3,168,4],[59,2,59,3],[60,2,60,3],[61,2,61,3],[167,3,167,4],[117,1,117,7],[120,1,120,7],[123,1,123,7],[110,0,110,7],[96,0,96,7],[98,0,108,7],[134,0,134,7],[114,1,114,7],[67,1,67,7],[141,0,141,7],[161,0,161,6],[0,0,0,7],[39,1,39,3],[40,1,40,3],[41,1,41,3],[12,0,12,7],[14,1,14,2],[16,1,16,2],[18,1,18,2],[22,4,22,7],[7,0,7,7],[22,1,22,2],[24,4,24,7],[30,4,30,5],[4,0,4,7],[29,4,29,7],[5,0,5,7],[1,0,1,7],[140,0,140,2],[135,0,135,7],[136,0,136,7],[137,0,137,7],[138,0,138,7],[139,0,139,7],[54,2,54,3],[42,1,42,3],[43,1,43,3],[8,0,8,7],[19,4,19,7],[54,0,54,1],[20,1,20,2],[25,4,25,7],[10,0,10,5]]}
["Demande d'aide financière au Fonds d'intervention pour le développement du secteur agroalimentaire (FIDSA)"]
["Formulaire de demande individuelle"]
[]
["Points importants:"]
["• Afin de déterminer si vous êtes admissible, veuillez consulter le cahier des mesures."]
["• Nous vous invitons à enregistrer votre formulaire sur votre ordinateur avant de commencer la rédaction pour éviter de perdre les informations."]
["• Vous visez l'aide à la formation pour la relève dans la mesure 1.D. Veuillez contacter Gaspésie Gourmande pour le recevoir au courriel suivant:",null,null,null,null,null,"fidsa@gaspesiegourmande.com"]
["• Pour toutes questions sur le formulaire, vous pouvez contacter Gaspésie Gourmande pour recevoir du soutien technique. "]
["• Pour recevoir de l'aide pour remplir votre formulaire, vous pouvez contacter votre MRC."]
[]
["Instructions: Pour bien completer la demande, veuillez remplir les cellules obligatoire jaune avec un contour rouge, ainsi que la section sur le financement du projet.",null,null,null,null,null,"À remplir","Remplis"]
[]
["Renseignements sur le demandeur et son représentant"]
[]
["Nom de l'entreprise",null,null,null,"Statut",null,null,null,null,1]
[]
["Répondant",null,null,null,"Production principale",null,null,null,null,1]
[]
["Adresse",null,null,null,"Quelle situation représente le mieux l'entreprise"]
[null,null,null,null,null,null,null,null,null,1,null,{"$f":"_xlfn.IFS(E26=LISTES!B128,25000,DEMANDE!E26=LISTES!B129,20000,DEMANDE!E26=LISTES!B127,20000,E26=\"\",20000)","v":20000}]
["Ville"]
[null,null,null,null,"Formation complétée et reconnue par la Financière agricole du Québec"]
["Municipalité où se déroule le projet"]
[]
["Code postal",null,null,null,"Catégorie type de relève (page 11 du cahier des mesures)",null,null,null,null,1]
[null,null,null,null,null,null,null,null,null,1,null,{"$f":"_xlfn.IFS(E31>0,25000,E31=\"\",20000)","v":20000}]
["Téléphone"]
[null,null,null,null,"Certification biologique ou précertification biologique"]
["Courriel"]
[null,null,null,null,"SI oui, avec quel organisme de certification?"]
["Numéro d'identification ministériel (NIM)"]
[]
["Propriétaire ou locataire du terrain"]
[]
["Titre du projet",null,null,null,null,null,null,null,null,1]
[]
[]
["Liste des investissements prévus"]
["Investissements","Mesure",null,null,"Coût","Aide financière potentielle","Date \nde début","Date \nde fin"]
[null,null,null,null,null,{"$f":"MIN((MAX($L$20,$L$26,(_xlfn.XLOOKUP(DEMANDE!B40,LISTES!$B$15:$B$25,LISTES!$G$15:$G$25,\"0\",0,1)))),(E40/2))","v":0},null,null,null,2]
{"$rows_left_out":130}
{"sheet":"ANALYSE","index":1,"n_rows":185,"n_cols":14,"rows_kept":185,"cut":false,"hidden":true,"merged":[[184,0,184,3],[173,1,173,3],[176,0,176,3],[177,0,177,3],[178,1,178,3],[179,0,179,3],[181,0,181,1],[182,0,182,1],[180,0,180,1],[68,0,68,1],[69,0,69,1],[63,2,63,3],[69,2,69,3],[183,0,183,3],[63,0,63,1],[64,0,64,1],[65,0,65,1],[65,2,65,3],[66,2,66,3],[172,0,172,3],[162,3,162,4],[26,0,26,8],[27,5,27,8],[27,0,27,4],[0,0,0,8],[11,0,11,8],[10,0,10,8],[4,7,4,8],[5,7,5,8],[6,7,6,8],[7,7,7,8],[28,14,28,16],[41,14,41,16],[93,0,93,8],[55,0,58,8],[87,0,90,8],[66,0,66,1],[67,0,67,1],[61,0,61,8],[62,2,62,3],[64,2,64,3],[62,0,62,1],[63,8,65,8],[71,2,71,3],[71,0,71,1],[67,2,67,3],[68,2,68,3],[95,6,95,8],[156,1,156,2],[70,2,70,3],[170,2,170,3],[171,1,171,3],[159,1,159,2],[142,0,145,8],[96,6,107,8],[139,0,139,8],[109,6,109,8],[134,0,137,8],[121,6,121,8],[147,5,147,8],[70,0,70,1],[162,6,162,7]]}
["Formulaire d'analyse de projet"]
[]
["Titre du projet: ",{"$f":"IF(DEMANDE!B35=\"\",\"\",DEMANDE!B35)","v":""}]
[]
["Nom de l'entreprise",{"$f":"IF(DEMANDE!B15=\"\",\"\",DEMANDE!B15)","v":""},null,"NIM",{"$f":"IF(DEMANDE!B31=\"\",\"\",DEMANDE!B31)","v":""},null,"Numéro de projet : "]
["Répondant",{"$f":"IF(DEMANDE!B17=\"\",\"\",DEMANDE!B17)","v":""},null,"Téléphone",{"$f":"IF(DEMANDE!B27=\"\",\"\",DEMANDE!B27)","v":""},null,"Date de réception du projet: "]
["Adresse",{"$f":"IF(DEMANDE!B19=\"\",\"\",DEMANDE!B19)","v":""},null,"Courriel",{"$f":"IF(DEMANDE!B29=\"\",\"\",DEMANDE!B29)","v":""},null,"Répondant MAPAQ : "]
["Ville",{"$f":"IF(DEMANDE!B21=\"\",\"\",DEMANDE!B21)","v":""},null,null,null,null,"Aide déjà reçue dans le FIDSA:"]
["Code postal",{"$f":"IF(DEMANDE!B25=\"\",\"\",DEMANDE!B25)","v":""}]
[]
["Admissibilité de la demande et du promoteur"]
[]
["Entreprise enregistrée au MAPAQ (détient un NIM)",null,null,null,null,null,null,null,null,null,null,null,null,1]
[]
["Projet localisé sur le territoire de la Gaspésie ou des Îles-de-la-Madeleine",null,null,null,null,null,null,null,null,null,null,null,null,1]
[]
["L'entreprise est propriétaire de la parcelle sur laquelle se fera le projet ou détient un bail",null,null,null,null,null,null,null,null,null,null,null,null,1]
[]
["Tous les documents exigés dans la section « à considérer » de la mesure correspondante au Cahier des mesures sont déposés",null,null,null,null,null,null,null,null,null,null,null,null,1]
[]
["Au moins un investissement présenté dans la demande est admissible à une aide",null,null,null,null,null,null,null,null,null,null,null,null,1]
[]
["Présences de soumissions pour toutes les dépenses de plus de 2 000 $ "]
[null,null,null,null,null,null,null,null,null,null,null,null,null,1]
["Le montage financier est confirmé ou en voie de l'être "]
[null,null,null,null,null,null,null,null,null,null,null,null,null,1]
["Investissements prévus"]
["Demande du client",null,null,null,null,"Lettre d'offre"]
["Investissements","Mesures choisies par le client","Coût prévue","Aide financière","Échance prévue par le client","Mesures proposées","Coûts totaux","Coût admissible","Aide financière"]
[{"$f":"IF(DEMANDE!A40=\"\",\"\",DEMANDE!A40)","v":""},{"$f":"IF(A30=\"\",\"\",IFERROR(VLOOKUP(M30,LISTES!$A$15:$B$25,2),\"\"))","v":""},{"$f":"DEMANDE!E40","v":0},{"$f":"DEMANDE!F40","v":0},{"$f":"IF(DEMANDE!H40=\"\",\"\",DEMANDE!H40)","v":""},{"$f":"IF(DEMANDE!B40>0,DEMANDE!B40,\"-\")","v":"-"},null,null,{"$f":"MIN(DEMANDE!$L$20,DEMANDE!$L$26,(H30*0.5))","v":0},null,null,null,{"$f":"DEMANDE!J40","v":2},1]
[{"$f":"IF(DEMANDE!A41=\"\",\"\",DEMANDE!A41)","v":""},{"$f":"IF(A31=\"\",\"\",IFERROR(VLOOKUP(M31,LISTES!$A$15:$B$25,2),\"\"))","v":""},{"$f":"DEMANDE!E41","v":0},{"$f":"DEMANDE!F41","v":0},{"$f":"IF(DEMANDE!H41=\"\",\"\",DEMANDE!H41)","v":""},{"$f":"IF(DEMANDE!B41>0,DEMANDE!B41,\"-\")","v":"-"},null,null,{"$f":"MIN(DEMANDE!$L$20,DEMANDE!$L$26,(H31*0.5))","v":0},null,null,null,{"$f":"DEMANDE!J41","v":2},1]
[{"$f":"IF(DEMANDE!A42=\"\",\"\",DEMANDE!A42)","v":""},{"$f":"IF(A32=\"\",\"\",IFERROR(VLOOKUP(M32,LISTES!$A$15:$B$25,2),\"\"))","v":""},{"$f":"DEMANDE!E42","v":0},{"$f":"DEMANDE!F42","v":0},{"$f":"IF(DEMANDE!H42=\"\",\"\",DEMANDE!H42)","v":""},{"$f":"IF(DEMANDE!B42>0,DEMANDE!B42,\"-\")","v":"-"},null,null,{"$f":"MIN(DEMANDE!$L$20,DEMANDE!$L$26,(H32*0.5))","v":0},null,null,null,{"$f":"DEMANDE!J42","v":2},1]
[{"$f":"IF(DEMANDE!A43=\"\",\"\",DEMANDE!A43)","v":""},{"$f":"IF(A33=\"\",\"\",IFERROR(VLOOKUP(M33,LISTES!$A$15:$B$25,2),\"\"))","v":""},{"$f":"DEMANDE!E43","v":0},{"$f":"DEMANDE!F43","v":0},{"$f":"IF(DEMANDE!H43=\"\",\"\",DEMANDE!H43)","v":""},{"$f":"IF(DEMANDE!B43>0,DEMANDE!B43,\"-\")","v":"-"},null,null,{"$f":"MIN(DEMANDE!$L$20,DEMANDE!$L$26,(H33*0.5))","v":0},null,null,null,{"$f":"DEMANDE!J43","v":1},1]
[{"$f":"IF(DEMANDE!A44=\"\",\"\",DEMANDE!A44)","v":""},{"$f":"IF(A34=\"\",\"\",IFERROR(VLOOKUP(M34,LISTES!$A$15:$B$25,2),\"\"))","v":""},{"$f":"DEMANDE!E44","v":0},{"$f":"DEMANDE!F44","v":0},{"$f":"IF(DEMANDE!H44=\"\",\"\",DEMANDE!H44)","v":""},{"$f":"IF(DEMANDE!B44>0,DEMANDE!B44,\"-\")","v":"-"},null,null,{"$f":"MIN(DEMANDE!$L$20,DEMANDE!$L$26,(H34*0.5))","v":0},null,null,null,{"$f":"DEMANDE!J44","v":1},1]
[{"$f":"IF(DEMANDE!A45=\"\",\"\",DEMANDE!A45)","v":""},{"$f":"IF(A35=\"\",\"\",IFERROR(VLOOKUP(M35,LISTES!$A$15:$B$25,2),\"\"))","v":""},{"$f":"DEMANDE!E45","v":0},{"$f":"DEMANDE!F45","v":0},{"$f":"IF(DEMANDE!H45=\"\",\"\",DEMANDE!H45)","v":""},{"$f":"IF(DEMANDE!B45>0,DEMANDE!B45,\"-\")","v":"-"},null,null,{"$f":"MIN(DEMANDE!$L$20,DEMANDE!$L$26,(H35*0.5))","v":0},null,null,null,{"$f":"DEMANDE!J45","v":1},1]
[{"$f":"IF(DEMANDE!A46=\"\",\"\",DEMANDE!A46)","v":""},{"$f":"IF(A36=\"\",\"\",IFERROR(VLOOKUP(M36,LISTES!$A$15:$B$25,2),\"\"))","v":""},{"$f":"DEMANDE!E46","v":0},{"$f":"DEMANDE!F46","v":0},{"$f":"IF(DEMANDE!H46=\"\",\"\",DEMANDE!H46)","v":""},{"$f":"IF(DEMANDE!B46>0,DEMANDE!B46,\"-\")","v":"-"},null,null,{"$f":"MIN(DEMANDE!$L$20,DEMANDE!$L$26,(H36*0.5))","v":0},null,null,null,{"$f":"DEMANDE!J46","v":1},1]
[{"$f":"IF(DEMANDE!A47=\"\",\"\",DEMANDE!A47)","v":""},{"$f":"IF(A37=\"\",\"\",IFERROR(VLOOKUP(M37,LISTES!$A$15:$B$25,2),\"\"))","v":""},{"$f":"DEMANDE!E47","v":0},{"$f":"DEMANDE!F47","v":0},{"$f":"IF(DEMANDE!H47=\"\",\"\",DEMANDE!H47)","v":""},{"$f":"IF(DEMANDE!B47>0,DEMANDE!B47,\"-\")","v":"-"},null,null,{"$f":"MIN(DEMANDE!$L$20,DEMANDE!$L$26,(H37*0.5))","v":0},null,null,null,{"$f":"DEMANDE!J47","v":1},1]
[{"$f":"IF(DEMANDE!A48=\"\",\"\",DEMANDE!A48)","v":""},{"$f":"IF(A38=\"\",\"\",IFERROR(VLOOKUP(M38,LISTES!$A$15:$B$25,2),\"\"))","v":""},{"$f":"DEMANDE!E48","v":0},{"$f":"DEMANDE!F48","v":0},{"$f":"IF(DEMANDE!H48=\"\",\"\",DEMANDE!H48)","v":""},{"$f":"IF(DEMANDE!B48>0,DEMANDE!B48,\"-\")","v":"-"},null,null,{"$f":"MIN(DEMANDE!$L$20,DEMANDE!$L$26,(H38*0.5))","v":0},null,null,null,{"$f":"DEMANDE!J48","v":1},1]
[{"$f":"IF(DEMANDE!A49=\"\",\"\",DEMANDE!A49)","v":""},{"$f":"IF(A39=\"\",\"\",IFERROR(VLOOKUP(M39,LISTES!$A$15:$B$25,2),\"\"))","v":""},{"$f":"DEMANDE!E49","v":0},{"$f":"DEMANDE!F49","v":0},{"$f":"IF(DEMANDE!H49=\"\",\"\",DEMANDE!H49)","v":""},{"$f":"IF(DEMANDE!B49>0,DEMANDE!B49,\"-\")","v":"-"},null,null,{"$f":"MIN(DEMANDE!$L$20,DEMANDE!$L$26,(H39*0.5))","v":0},null,null,null,{"$f":"DEMANDE!J49","v":1},1]
[{"$f":"IF(DEMANDE!A50=\"\",\"\",DEMANDE!A50)","v":""},{"$f":"IF(A40=\"\",\"\",IFERROR(VLOOKUP(M40,LISTES!$A$15:$B$25,2),\"\"))","v":""},{"$f":"DEMANDE!E50","v":0},{"$f":"DEMANDE!F50","v":0},{"$f":"IF(DEMANDE!H50=\"\",\"\",DEMANDE!H50)","v":""},{"$f":"IF(DEMANDE!B50>0,DEMANDE!B50,\"-\")","v":"-"},null,null,{"$f":"MIN(DEMANDE!$L$20,DEMANDE!$L$26,(H40*0.5))","v":0},null,null,null,{"$f":"DEMANDE!J50","v":1},1]
{"$rows_left_out":146}
{"sheet":"COMITÉ DE RECOMMANDATIONS","index":2,"n_rows":188,"n_cols":14,"rows_kept":188,"cut":false,"hidden":true,"merged":[[45,2,45,3],[0,0,0,8],[17,0,20,8],[22,0,22,6],[24,1,24,3],[43,2,43,3],[37,1,37,2],[42,6,44,6],[40,0,40,6],[42,0,42,1],[42,2,42,3],[44,0,44,1],[44,2,44,3],[53,0,53,6],[41,2,41,3],[41,0,41,1],[49,0,49,1],[49,2,49,3],[46,0,46,1],[46,2,46,3],[47,0,47,1],[47,2,47,3],[48,0,48,1],[48,2,48,3],[43,0,43,1],[50,0,50,3],[51,0,51,3],[45,6,49,6],[45,0,45,1]]}
["Recommandation du comité"]
[]
["Frais de gestion","Complexité:",{"$f":"ANALYSE!B42","v":"Faible"},0]
[]
["Pointage Évaluation du projet par l'analyste",{"$f":"ANALYSE!B148","v":0},"/75",{"$f":"B5/75","v":0}]
[]
["Pointage des critères de priorisation ",null,"/10",{"$f":"B7/10","v":0}]
[]
["Pointage Comité de recommandations",null,"/15",{"$f":"B9/15","v":0}]
[]
["Pointage Total",{"$f":"B5+B9","v":0},"/100",{"$f":"B11/100","v":0}]
[]
["Recommandation"]
[]
[]
[]
["Commentaires ou conditions particulières"]
[]
[]
[]
[]
[]
["Lettre d'offre "]
[]
["Investissements","Mesures proposées",null,null,"Coûts totaux","Coût admissible","Aide financière"]
[{"$f":"ANALYSE!A30","v":""},{"$f":"ANALYSE!F30","v":"-"},null,null,{"$f":"ANALYSE!G30","v":0},{"$f":"ANALYSE!H30","v":0},{"$f":"ANALYSE!I30","v":0}]
[{"$f":"ANALYSE!A31","v":""},{"$f":"ANALYSE!F31","v":"-"},null,null,{"$f":"ANALYSE!G31","v":0},{"$f":"ANALYSE!H31","v":0},{"$f":"ANALYSE!I31","v":0}]
[{"$f":"ANALYSE!A32","v":""},{"$f":"ANALYSE!F32","v":"-"},null,null,{"$f":"ANALYSE!G32","v":0},{"$f":"ANALYSE!H32","v":0},{"$f":"ANALYSE!I32","v":0}]
[{"$f":"ANALYSE!A33","v":""},{"$f":"ANALYSE!F33","v":"-"},null,null,{"$f":"ANALYSE!G33","v":0},{"$f":"ANALYSE!H33","v":0},{"$f":"ANALYSE!I33","v":0}]
[{"$f":"ANALYSE!A34","v":""},{"$f":"ANALYSE!F34","v":"-"},null,null,{"$f":"ANALYSE!G34","v":0},{"$f":"ANALYSE!H34","v":0},{"$f":"ANALYSE!I34","v":0}]
[{"$f":"ANALYSE!A35","v":""},{"$f":"ANALYSE!F35","v":"-"},null,null,{"$f":"ANALYSE!G35","v":0},{"$f":"ANALYSE!H35","v":0},{"$f":"ANALYSE!I35","v":0}]
[{"$f":"ANALYSE!A36","v":""},{"$f":"ANALYSE!F36","v":"-"},null,null,{"$f":"ANALYSE!G36","v":0},{"$f":"ANALYSE!H36","v":0},{"$f":"ANALYSE!I36","v":0}]
[{"$f":"ANALYSE!A37","v":""},{"$f":"ANALYSE!F37","v":"-"},null,null,{"$f":"ANALYSE!G37","v":0},{"$f":"ANALYSE!H37","v":0},{"$f":"ANALYSE!I37","v":0}]
[{"$f":"ANALYSE!A38","v":""},{"$f":"ANALYSE!F38","v":"-"},null,null,{"$f":"ANALYSE!G38","v":0},{"$f":"ANALYSE!H38","v":0},{"$f":"ANALYSE!I38","v":0}]
[{"$f":"ANALYSE!A39","v":""},{"$f":"ANALYSE!F39","v":"-"},null,null,{"$f":"ANALYSE!G39","v":0},{"$f":"ANALYSE!H39","v":0},{"$f":"ANALYSE!I39","v":0}]
[{"$f":"ANALYSE!A40","v":""},{"$f":"ANALYSE!F40","v":"-"},null,null,{"$f":"ANALYSE!G40","v":0},{"$f":"ANALYSE!H40","v":0},{"$f":"ANALYSE!I40","v":0}]
[null,null,null,null,{"$f":"SUM(E26:E36)","v":0},{"$f":"SUM(F26:F36)","v":0},0]
[null,"Frais de gestion (0 à 10 %)",null,{"$f":"D3","v":0},{"$f":"D38*E37","v":0},{"$f":"D38*G37","v":0},{"$f":"G37/2","v":0}]
[null,null,null,null,null,null,{"$f":"G37+G38","v":0}]
[]
{"$rows_left_out":149}
{"sheet":"BILAN","index":3,"n_rows":79,"n_cols":16,"rows_kept":79,"cut":false,"hidden":true,"merged":[[11,10,11,11],[11,12,11,13],[11,14,11,15],[29,6,29,8],[0,0,0,8],[3,5,3,6],[2,5,2,6],[78,7,78,8],[75,2,75,4],[10,0,10,3],[10,4,10,6],[27,4,27,5],[26,3,26,5],[29,0,29,5],[23,0,25,0]]}
["Formulaire de bilan de projet et de réclamation"]
[]
["Nom de l'entreprise",null,{"$f":"IF(DEMANDE!B15=\"\",\"\",DEMANDE!B15)","v":""},null,"Numéro de projet : ",{"$f":"IF(ANALYSE!H5=\"\",\"\",ANALYSE!H5)","v":""}]
["Répondant",null,{"$f":"IF(DEMANDE!B17=\"\",\"\",DEMANDE!B17)","v":""},null,"Répondant MAPAQ :",{"$f":"IF(ANALYSE!H7=\"\",\"\",ANALYSE!H7)","v":""}]
["Adresse",null,{"$f":"IF(DEMANDE!B19=\"\",\"\",DEMANDE!B19)","v":""}]
["Ville",null,{"$f":"IF(DEMANDE!B21=\"\",\"\",DEMANDE!B21)","v":""},null,"Réclamation",1,{"$f":"L24","v":0}]
["Téléphone",null,{"$f":"IF(DEMANDE!B27=\"\",\"\",DEMANDE!B27)","v":""},null,"Réclamation",2,{"$f":"N24","v":0}]
[null,null,null,null,"Réclamation",3,{"$f":"P24","v":0}]
[null,null,null,null,null,null,{"$f":"SUM(G6:G8)","v":0}]
[]
["Coût prévue et aide financière estimée",null,null,null,"Coût et aide du projet réalisé"]
["No associé à l'investissement initial","Investissements prévus dans la demande","Coût d'acquisition prévue","Aide financière demandée","Investissements réalisés dans le projet","Coût d'acquisition réel","Aide financière demandée",null,null,null,"Réclamation 1",null,"Réclamation 2",null,"Réclamation 3"]
[1,{"$f":"ANALYSE!A30","v":""},{"$f":"DEMANDE!E40","v":0},{"$f":"DEMANDE!F40","v":0},null,{"$f":"SUMIF($A$32:$A$67,A13,$G$32:$G$67)","v":0},{"$f":"F13*0.5","v":0},null,null,null,{"$f":"SUMIFS($G$32:$G$67,$A$32:$A$67,$A13,$H$32:$H$67,1)","v":0},{"$f":"K13*(IF(DEMANDE!J40=3,60%,(IF(DEMANDE!J40=4,30%,50%))))","v":0},{"$f":"SUMIFS($G$32:$G$67,$A$32:$A$67,$A13,$H$32:$H$67,2)","v":0},{"$f":"M13*(IF(DEMANDE!L40=3,60%,(IF(DEMANDE!L40=4,30%,50%))))","v":0},{"$f":"SUMIFS($G$32:$G$67,$A$32:$A$67,$A13,$H$32:$H$67,3)","v":0},{"$f":"O13*(IF(DEMANDE!N40=3,60%,(IF(DEMANDE!N40=4,30%,50%))))","v":0}]
[2,{"$f":"ANALYSE!A31","v":""},{"$f":"DEMANDE!E41","v":0},{"$f":"DEMANDE!F41","v":0},null,{"$f":"SUMIF($A$32:$A$67,A14,$G$32:$G$67)","v":0},{"$f":"F14*0.5","v":0},null,null,null,0,{"$f":"K14*(IF(DEMANDE!J41=3,60%,(IF(DEMANDE!J41=4,30%,50%))))","v":0},0,{"$f":"M14*(IF(DEMANDE!L41=3,60%,(IF(DEMANDE!L41=4,30%,50%))))","v":0},0,{"$f":"O14*(IF(DEMANDE!N41=3,60%,(IF(DEMANDE!N41=4,30%,50%))))","v":0}]
[3,{"$f":"ANALYSE!A32","v":""},{"$f":"DEMANDE!E42","v":0},{"$f":"DEMANDE!F42","v":0},null,0,0,null,null,null,0,{"$f":"K15*(IF(DEMANDE!J42=3,60%,(IF(DEMANDE!J42=4,30%,50%))))","v":0},0,{"$f":"M15*(IF(DEMANDE!L42=3,60%,(IF(DEMANDE!L42=4,30%,50%))))","v":0},0,{"$f":"O15*(IF(DEMANDE!N42=3,60%,(IF(DEMANDE!N42=4,30%,50%))))","v":0}]
[4,{"$f":"ANALYSE!A33","v":""},{"$f":"DEMANDE!E43","v":0},{"$f":"DEMANDE!F43","v":0},null,0,0,null,null,null,0,{"$f":"K16*(IF(DEMANDE!J43=3,60%,(IF(DEMANDE!J43=4,30%,50%))))","v":0},0,{"$f":"M16*(IF(DEMANDE!L43=3,60%,(IF(DEMANDE!L43=4,30%,50%))))","v":0},0,{"$f":"O16*(IF(DEMANDE!N43=3,60%,(IF(DEMANDE!N43=4,30%,50%))))","v":0}]
[5,{"$f":"ANALYSE!A34","v":""},{"$f":"DEMANDE!E44","v":0},{"$f":"DEMANDE!F44","v":0},null,0,0,null,null,null,0,{"$f":"K17*(IF(DEMANDE!J44=3,60%,(IF(DEMANDE!J44=4,30%,50%))))","v":0},0,{"$f":"M17*(IF(DEMANDE!L44=3,60%,(IF(DEMANDE!L44=4,30%,50%))))","v":0},0,{"$f":"O17*(IF(DEMANDE!N44=3,60%,(IF(DEMANDE!N44=4,30%,50%))))","v":0}]
[6,{"$f":"ANALYSE!A35","v":""},{"$f":"DEMANDE!E45","v":0},{"$f":"DEMANDE!F45","v":0},null,0,0,null,null,null,0,{"$f":"K18*(IF(DEMANDE!J45=3,60%,(IF(DEMANDE!J45=4,30%,50%))))","v":0},0,{"$f":"M18*(IF(DEMANDE!L45=3,60%,(IF(DEMANDE!L45=4,30%,50%))))","v":0},0,{"$f":"O18*(IF(DEMANDE!N45=3,60%,(IF(DEMANDE!N45=4,30%,50%))))","v":0}]
[7,{"$f":"ANALYSE!A36","v":""},{"$f":"DEMANDE!E46","v":0},{"$f":"DEMANDE!F46","v":0},null,0,0,null,null,null,0,{"$f":"K19*(IF(DEMANDE!J46=3,60%,(IF(DEMANDE!J46=4,30%,50%))))","v":0},0,{"$f":"M19*(IF(DEMANDE!L46=3,60%,(IF(DEMANDE!L46=4,30%,50%))))","v":0},0,{"$f":"O19*(IF(DEMANDE!N46=3,60%,(IF(DEMANDE!N46=4,30%,50%))))","v":0}]
[8,{"$f":"ANALYSE!A37","v":""},{"$f":"DEMANDE!E47","v":0},{"$f":"DEMANDE!F47","v":0},null,0,0,null,null,null,0,{"$f":"K20*(IF(DEMANDE!J47=3,60%,(IF(DEMANDE!J47=4,30%,50%))))","v":0},0,{"$f":"M20*(IF(DEMANDE!L47=3,60%,(IF(DEMANDE!L47=4,30%,50%))))","v":0},0,{"$f":"O20*(IF(DEMANDE!N47=3,60%,(IF(DEMANDE!N47=4,30%,50%))))","v":0}]
[9,{"$f":"ANALYSE!A38","v":""},{"$f":"DEMANDE!E48","v":0},{"$f":"DEMANDE!F48","v":0},null,0,0,null,null,null,0,{"$f":"K21*(IF(DEMANDE!J48=3,60%,(IF(DEMANDE!J48=4,30%,50%))))","v":0},0,{"$f":"M21*(IF(DEMANDE!L48=3,60%,(IF(DEMANDE!L48=4,30%,50%))))","v":0},0,{"$f":"O21*(IF(DEMANDE!N48=3,60%,(IF(DEMANDE!N48=4,30%,50%))))","v":0}]
[10,{"$f":"ANALYSE!A39","v":""},{"$f":"DEMANDE!E49","v":0},{"$f":"DEMANDE!F49","v":0},null,0,0,null,null,null,0,{"$f":"K22*(IF(DEMANDE!J49=3,60%,(IF(DEMANDE!J49=4,30%,50%))))","v":0},0,{"$f":"M22*(IF(DEMANDE!L49=3,60%,(IF(DEMANDE!L49=4,30%,50%))))","v":0},0,{"$f":"O22*(IF(DEMANDE!N49=3,60%,(IF(DEMANDE!N49=4,30%,50%))))","v":0}]
[11,{"$f":"ANALYSE!A40","v":""},{"$f":"DEMANDE!E50","v":0},{"$f":"DEMANDE!F50","v":0},null,0,0,null,null,null,0,{"$f":"K23*(IF(DEMANDE!J50=3,60%,(IF(DEMANDE!J50=4,30%,50%))))","v":0},0,{"$f":"M23*(IF(DEMANDE!L50=3,60%,(IF(DEMANDE!L50=4,30%,50%))))","v":0},0,{"$f":"O23*(IF(DEMANDE!N50=3,60%,(IF(DEMANDE!N50=4,30%,50%))))","v":0}]
[null,"Coût du projet et aide financière",{"$f":"DEMANDE!E51","v":0},{"$f":"DEMANDE!F51","v":0},"Coût du projet et aide financière",{"$f":"SUM(F13:F23)","v":0},{"$f":"MIN(DEMANDE!L20,DEMANDE!L26,SUM(G13:G23))","v":0},null,null,null,{"$f":"SUM(K13:K23)","v":0},0,0,0,0,0]
[null,"Frais de gestion (5 à 10 %)",{"$f":"ANALYSE!C42","v":0},{"$f":"ANALYSE!D42","v":0},"Frais de gestion (5 à 10 %)",{"$f":"ANALYSE!G42*SUM(F13:F23)","v":0},{"$f":"ANALYSE!G42*SUM(G13:G23)","v":0}]
[null,null,{"$f":"C24+C25","v":0},{"$f":"D24+D25","v":0},null,{"$f":"F24+F25","v":0},{"$f":"MIN(DEMANDE!L20,DEMANDE!L26,G24+G25)","v":0}]
[null,null,null,"Solde ou dépassement (en négatif) de l'engagement initial :",null,null,{"$f":"D26-G26","v":0}]
[null,null,null,null,"Dépassement de l'engagement initial (en %) :",null,{"$f":"IFERROR(IF(G24>D24,-(G27/D24),0),\"\")","v":0}]
[]
["Liste des pièces justificatives et liens avec les investissements dans le tableau du haut",null,null,null,null,null,"À l'usage du MAPAQ"]
["No associé à l'investissement initial","Type de dépenses","Date","No de facture","Fournisseur","Montants avant taxes","Montants admissibles avant taxes","Séquence de réclamations","Date de réclamation"]
[]
[]
[]
[]
[]
[]
[]
[]
[]
{"$rows_left_out":40}
{"sheet":"LISTES","index":4,"n_rows":221,"n_cols":10,"rows_kept":221,"cut":false,"hidden":true,"merged":[]}
[]
[]
[null,"Démarrage (entreprise qui n'a pas encore de ventes)"]
[null,"Démarrage (entreprise en production depuis moins de 5 ans)"]
[null,"Transfert (au moins un nouveau propriétaire depuis moins de 5 ans)"]
[null,"Expansion (Production en croissance)"]
[null,"Consolidation (Production stable)"]
[]
[]
[null,"Au moins un propriétaire de moins de 45 ans a 20 % des parts, établi depuis moins de 5 ans"]
[null,"Au moins un propriétaire de moins de 45 ans"]
[null,"Tous les propriétaires ont plus de 45 ans, établi depuis moins de 5 ans"]
[null,"Tous les propriétaires ont plus de 45 ans"]
[]
[1,"-"]
[2,"1.A - Dév. entreprises : Aide - individuel",null,null,null,null,20000,{"$f":"SUMIF(ANALYSE!$N$30:$N$40,A16,ANALYSE!$I$30:$I$40)","v":0},{"$f":"IF(H16>G16,\"Oui\",\"Non\")","v":"Non"},0.5]
[3,"1.A - Dév. entreprises : Aide - CUMA",null,null,null,null,20000,{"$f":"SUMIF(ANALYSE!$N$30:$N$40,A17,ANALYSE!$I$30:$I$40)","v":0},{"$f":"IF(H17>G17,\"Oui\",\"Non\")","v":"Non"},0.5]
[4,"1.B - Dév. entreprises : Prod. animales durables - Amé. durables",null,null,null,null,20000,{"$f":"SUMIF(ANALYSE!$N$30:$N$40,A18,ANALYSE!$I$30:$I$40)","v":0},"Non",0.5]
[5,"1.B - Dév. entreprises : Prod. animales durables - Dév. apiculture",null,null,null,null,20000,{"$f":"SUMIF(ANALYSE!$N$30:$N$40,A19,ANALYSE!$I$30:$I$40)","v":0},"Non",0.5]
[6,"1.C - Dév. entreprises : Amé. sols et C.C. - Drainage et nivellement",null,null,null,null,20000,{"$f":"SUMIF(ANALYSE!$N$30:$N$40,A20,ANALYSE!$I$30:$I$40)","v":0},"Non",0.5]
[7,"1.C - Dév. Entreprises : Amé. sols et C.C. - Cultures de couverture",null,null,null,null,20000,{"$f":"SUMIF(ANALYSE!$N$30:$N$40,A21,ANALYSE!$I$30:$I$40)","v":0},"Non",0.5]
[8,"Pour l'aide à la formation (1.D.) Contacter Gaspésie gourmande",null,null,null,null,5000,{"$f":"SUMIF(ANALYSE!$N$30:$N$40,A22,ANALYSE!$I$30:$I$40)","v":0},{"$f":"IF(H22>G22,\"Oui\",\"Non\")","v":"Non"},0.7]
[9,"1.D - Dév. Entreprises : Relève et établissement",null,null,null,null,25000,{"$f":"SUMIF(ANALYSE!$N$30:$N$40,A23,ANALYSE!$I$30:$I$40)","v":0},"Non",0.5]
[10,"1.E - Dév. Entreprises : Remise en culture d'une friche agricole",null,null,null,null,20000,{"$f":"SUMIF(ANALYSE!$N$30:$N$40,A24,ANALYSE!$I$30:$I$40)","v":0},"Non",0.5]
[11,"4 - Dév. activités de transformation",null,null,null,null,20000,{"$f":"SUMIF(ANALYSE!$N$30:$N$40,A25,ANALYSE!$I$30:$I$40)","v":0},"Non",0.5]
[]
[]
[]
[1]
[2,"1.1 Réduire le déficit de fertilité des sols"]
[3,"1.2 Soutenir les producteurs dans l’adoption de bonnes pratiques visant l’amélioration de la santé des sols et leur rendement"]
[4,"1.3 Soutenir le secteur et les entreprises dans les défis reliés à l’adaptation aux changements climatiques"]
[5,"3.3 Appuyer les entreprises dans leurs projets d’optimisation et de modernisation des infrastructures et équipements "]
[6,"3.6 Favoriser l’établissement de la relève et le transfert des entreprises existantes"]
[7,"4.2  Soutenir les initiatives visant l’amélioration de la performance des cheptels "]
[8,"5.3 Appuyer la transférabilité des fermes pour sécuriser le territoire agricole cultivé de la région"]
[]
[]
[null,"Aucune formation reconnue/Ne s'applique pas"]
[null,"Aucun formation reconnu, mais au moins 3 ans d'expérience agricole"]
{"$rows_left_out":182}
{"sheet":"INFOS","index":5,"n_rows":3,"n_cols":7,"rows_kept":3,"cut":false,"hidden":true,"merged":[]}
[]
[]
[null,null,{"$f":"DEMANDE!B15","v":0},{"$f":"DEMANDE!B17","v":0},{"$f":"DEMANDE!B19","v":0},{"$f":"DEMANDE!B21","v":0},{"$f":"DEMANDE!B27","v":0}]